2β-hydroxy-6α-cyanide-trans-decalin

Kovats' RI, non-polar column, isothermal

Data compiled by: NIST Mass Spectrometry Data Center, William E. Wallace, director

Column type Packed
Active phase OV-1
Column length (m) 1.
Carrier gas N2
Substrate Gas Chrom Q (100-120 mesh)
Column diameter (mm)
Phase thickness (μm)
Temperature (C) 130.
I 1604.
ReferenceTakeda and Yamamoto, 1972
Comment MSDC-RI

References

Takeda and Yamamoto, 1972
Takeda, K.; Yamamoto, S., Gas chromatographic identification of 2,6-disubstituted-trans-decalins using retention indices, Chem. Pharm. Bull., 1972, 20, 6, 1125-1130, https://doi.org/10.1248/cpb.20.1125 . [all data]