2β-acetyloxy-trans-decalin-6-one

Kovats' RI, non-polar column, isothermal

View large format table.

Column type Active phase Temperature (C) I Reference Comment
PackedOV-1130.1636.Takeda and Yamamoto, 1972N2, Gas Chrom Q (100-120 mesh); Column length: 1. m

Kovats' RI, polar column, isothermal

View large format table.

Column type Active phase Temperature (C) I Reference Comment
PackedCarbowax 20M180.2539.Takeda and Yamamoto, 1972N2, Gas Chrom Q (80-100 mesh); Column length: 1. m

References

Takeda and Yamamoto, 1972
Takeda, K.; Yamamoto, S., Gas chromatographic identification of 2,6-disubstituted-trans-decalins using retention indices, Chem. Pharm. Bull., 1972, 20, 6, 1125-1130, https://doi.org/10.1248/cpb.20.1125 . [all data]