Benzene, 1-methyl-2-pentyl

Normal alkane RI, polar column, isothermal

Data compiled by: NIST Mass Spectrometry Data Center, William E. Wallace, director

Column type CapillaryCapillaryCapillaryCapillaryCapillary
Active phase PEG-40MPEG-40MPEG-40MPEG-40MPEG-40M
Column length (m) 50.50.50.50.50.
Carrier gas
Substrate
Column diameter (mm)
Phase thickness (μm)
Temperature (C) 100.100.120.140.160.
I 1526.1527.1539.1555.1569.
ReferenceNesterov, Nesterova, et al., 2000Nesterov, Nesterova, et al., 2000Nesterov, Nesterova, et al., 2000Nesterov, Nesterova, et al., 2000Nesterov, Nesterova, et al., 2000
Comment MSDC-RI MSDC-RI MSDC-RI MSDC-RI MSDC-RI
Column type CapillaryCapillary
Active phase PEG-40MCarbowax 20M
Column length (m) 50.
Carrier gas
Substrate
Column diameter (mm)
Phase thickness (μm)
Temperature (C) 80.90.
I 1514.1489.
ReferenceNesterov, Nesterova, et al., 2000Sutter, Peterson, et al., 1997
Comment MSDC-RI MSDC-RI

Normal alkane RI, non-polar column, custom temperature program

Data compiled by: NIST Mass Spectrometry Data Center, William E. Wallace, director

Column type Capillary
Active phase OV-101
Column length (m) 52.
Carrier gas H2
Substrate
Column diameter (mm) 0.25
Phase thickness (μm) 0.38
Program 70 - 160 C at 1.5 deg/min; 160 - 280 C at 15 deg/min 15 min at 280 C
I 1248.
ReferenceMatisová, Juranyiová, et al., 1991
Comment MSDC-RI

References

Nesterov, Nesterova, et al., 2000
Nesterov, I.A.; Nesterova, T.N.; Pimerzin, A.A.; Tsvetkov, V.S., Thermodynamics of alkylbenzene sorption and evaporation. IV. Enthalpies of evaporation and thermodynamics chracteristics of sorption by stationary phases OV-101 and PEG-40M, Izvestia vysshikh uchebnykh zavedenii. Khimia i khimicheskaia tekhnologia (Chemistry and chemical technology), 2000, 43, 4, 39-45. [all data]

Sutter, Peterson, et al., 1997
Sutter, J.M.; Peterson, T.A.; Jurs, P.C., Prediction of gas chromatographic retention indices of alkylbenzenes, Anal. Chim. Acta., 1997, 342, 2-3, 113-122, https://doi.org/10.1016/S0003-2670(96)00578-8 . [all data]