Epi-testosterone, 3-HFB, 17β-Ac

Kovats' RI, non-polar column, isothermal

Data compiled by: NIST Mass Spectrometry Data Center, William E. Wallace, director

Column type Packed
Active phase OV-101
Column length (m) 1.5
Carrier gas
Substrate Gas Chrom Q
Column diameter (mm)
Phase thickness (μm)
Temperature (C) 210.
I 2547.
ReferenceDehennin, Reiffsteck, et al., 1972
Comment MSDC-RI

References

Dehennin, Reiffsteck, et al., 1972
Dehennin, L.; Reiffsteck, A.; Scholler, R., Halogenated diesters of testosterone. Response to electron capture detection, gas chromatographic and mass spectrometric properties, J. Chromatogr. Sci., 1972, 10, 4, 224-230, https://doi.org/10.1093/chromsci/10.4.224 . [all data]