3-methyl-dihydroindole

Kovats' RI, polar column, isothermal

Data compiled by: NIST Mass Spectrometry Data Center, William E. Wallace, director

Column type PackedPacked
Active phase PEG-20MPEG-20M
Column length (m) 2.2.
Carrier gas N2N2
Substrate Chromosorb W-AWChromosorb W-AW
Column diameter (mm)
Phase thickness (μm)
Temperature (C) 170.190.
I 2037.2060.
ReferenceTibor and Anna, 1971Tibor and Anna, 1971
Comment MSDC-RI MSDC-RI

References

Tibor and Anna, 1971
Tibor, T.; Anna, B., Gázkromatográfiás retenció és a kémiai szerkezet, I., Magy. Kem. Foly., 1971, 77, 576-587. [all data]