3-Chloro-tetrahydro-furan-2-carbonitrile

Kovats' RI, non-polar column, isothermal

View large format table.

Column type Active phase Temperature (C) I Reference Comment
PackedSilicon High Vacuum Grease (obsolete)170.995.Janák, Jonas, et al., 1965H2, Celite

References

Janák, Jonas, et al., 1965
Janák, J.; Jonas, J.; Kratochvíl, M., Identification of some acetals of the tetrahydrofurane sereis by gas chromatography with the aid of the Kováts indices, Collect. Czech. Chem. Commun., 1965, 30, 1, 265-276, https://doi.org/10.1135/cccc19650265 . [all data]