cis-Davanafuran

Van Den Dool and Kratz RI, non-polar column, temperature ramp

View large format table.

Column type Active phase I Reference Comment
CapillaryDB-51414.Isidorov, Zenkevich, et al., 2001He, 3. K/min; Column length: 30. m; Column diameter: 0.25 mm; Tstart: 50. C; Tend: 250. C

Normal alkane RI, non-polar column, custom temperature program

View large format table.

Column type Active phase I Reference Comment
CapillaryDB-51414.Isidorov, Zenkevich, et al., 2001He; Column length: 30. m; Column diameter: 0.25 mm; Program: not specified

References

Isidorov, Zenkevich, et al., 2001
Isidorov, V.A.; Zenkevich, I.G.; Krajewska, U.; Dubis, E.N.; Jaroszynska, J.; Bal, K., Gas chromatographic analysis of essential oils with preliminary partition of components, Phytochem. Anal., 2001, 12, 2, 87-90, https://doi.org/10.1002/pca.564 . [all data]