Ho-trienyl acetate

Normal alkane RI, non-polar column, custom temperature program

Data compiled by: NIST Mass Spectrometry Data Center, William E. Wallace, director

Column type CapillaryCapillary
Active phase SE-30Methyl Silicone
Column length (m)
Carrier gas
Substrate
Column diameter (mm)
Phase thickness (μm)
Program not specifiednot specified
I 1232.1232.
ReferenceVinogradov, 2004Zenkevich, 1999
Comment MSDC-RI MSDC-RI

References

Vinogradov, 2004
Vinogradov, B.A., Production, composition, properties and application of essential oils, 2004, retrieved from http://viness.narod.ru. [all data]

Zenkevich, 1999
Zenkevich, I.G., Analytical Parameters of Components of essential Oils for their Gas Chromatographic and Chromato-Mass-Spectral Identification. Acetates of Terpene Alcohols, Rastitelnye Resursy (Plant Resources), 1999, 35, 1, 30-37. [all data]