Benzene, 1-pentyl-4-propyl

Kovats' RI, non-polar column, isothermal

Data compiled by: NIST Mass Spectrometry Data Center, William E. Wallace, director

Column type Capillary
Active phase Squalane
Column length (m) 100.
Carrier gas N2
Substrate
Column diameter (mm) 0.23
Phase thickness (μm)
Temperature (C) 100.
I 1419.
ReferenceEngewald and Wennrich, 1976
Comment MSDC-RI

Kovats' RI, polar column, isothermal

View large format table.

Column type Active phase Temperature (C) I Reference Comment
CapillaryCarbowax 20M100.1636.3Engewald and Wennrich, 1976N2; Column length: 100. m; Column diameter: 0.23 mm

Normal alkane RI, polar column, isothermal

View large format table.

Column type Active phase Temperature (C) I Reference Comment
CapillaryCarbowax 20M90.1628.Sutter, Peterson, et al., 1997

Normal alkane RI, polar column, custom temperature program

View large format table.

Column type Active phase I Reference Comment
CapillaryCarbowax 20M1628.Ivanciuc, Ivanciuc, et al., 2001Program: not specified

References

Engewald and Wennrich, 1976
Engewald, W.; Wennrich, L., Molekülstruktur und Retentionsverhalten. VIII. Zum Retentionsverhalten höherer Alkylbenzole bei der Gas-Verteilungs-Chromatographie, Chromatographia, 1976, 9, 11, 540-547, https://doi.org/10.1007/BF02275960 . [all data]