Hexane, 1-bromo-2-methoxy

Kovats' RI, non-polar column, isothermal

Data compiled by: NIST Mass Spectrometry Data Center, William E. Wallace, director

Column type Capillary
Active phase Squalane
Column length (m) 100.
Carrier gas
Substrate
Column diameter (mm) 0.25
Phase thickness (μm)
Temperature (C) 115.
I 1032.
ReferenceLafosse and Thuaud-Chourrout, 1975
Comment MSDC-RI

References

Lafosse and Thuaud-Chourrout, 1975
Lafosse, M.; Thuaud-Chourrout, N., Etude du comportement de composés halogénés et mèthoxylés en CG dans le cas de quatre phases stationnaires liquides pouvant former des liaisons de type donneur-accepteur d'électrons avec les groupes fonctionnels de ces composés, Chromatographia, 1975, 8, 4, 195-202, https://doi.org/10.1007/BF02274456 . [all data]