Triethylene glycol, decyl-methyl ether

Kovats' RI, non-polar column, isothermal

View large format table.

Column type Active phase Temperature (C) I Reference Comment
PackedSE-30170.2121.Voelkel, 1987He, Chromaton N Super (75-100 mesh); Column length: 1. m

References

Voelkel, 1987
Voelkel, A., Retention Indices and Thermodynamic Functions of Solution for Model Non-Ionic Surfactants in Standard Stationary Phases Determined by Gas Chromatography, J. Chromatogr., 1987, 387, 95-104, https://doi.org/10.1016/S0021-9673(01)94516-9 . [all data]