4H-Pyrido[1,2-a]pyrimidin-4-one, 2,3-dimethyl

Kovats' RI, non-polar column, isothermal

View large format table.

Column type Active phase Temperature (C) I Reference Comment
PackedOV-1240.1727.Papp, Józan, et al., 1987N2, Gas Chrom Q (100-120 mesh); Column length: 1.8 m

References

Papp, Józan, et al., 1987
Papp, O.; Józan, M.; Szász, Gy.; Hermecz, I., Correlation Between Molar Refraction and Gas Chromatographic Retention Data, J. Chromatogr., 1987, 403, 11-18, https://doi.org/10.1016/S0021-9673(00)96336-2 . [all data]