3H-Pyrimidin-4-one, 2,3-pentamethyleno-5,6-trimethyleno

Kovats' RI, non-polar column, isothermal

Data compiled by: NIST Mass Spectrometry Data Center, William E. Wallace, director

Column type PackedPacked
Active phase OV-1OV-1
Column length (m) 1.81.8
Carrier gas N2N2
Substrate Chromosorb W AW DMCSGas Chrom Q (100-120 mesh)
Column diameter (mm)
Phase thickness (μm)
Temperature (C) 240.240.
I 2003.2003.
ReferencePapp, Szász, et al., 1991Papp, Józan, et al., 1987
Comment MSDC-RI MSDC-RI

References

Papp, Szász, et al., 1991
Papp, O.; Szász, Gy.; Kökösi, J.; Hermecz, I., Correlation between structure and gas chromatographic behaviour of nitrogen-containing heterocyclic compounds. III. Variation of ring size, J. Chromatogr., 1991, 537, 377-383, https://doi.org/10.1016/S0021-9673(01)88911-1 . [all data]

Papp, Józan, et al., 1987
Papp, O.; Józan, M.; Szász, Gy.; Hermecz, I., Correlation Between Molar Refraction and Gas Chromatographic Retention Data, J. Chromatogr., 1987, 403, 11-18, https://doi.org/10.1016/S0021-9673(00)96336-2 . [all data]