2H-Pyrido[2,1-b]quinazolin-6-one, 1,3,4,6,7,8,9,10-octahydro-8-methyl

Kovats' RI, non-polar column, isothermal

Data compiled by: NIST Mass Spectrometry Data Center, William E. Wallace, director

Column type Packed
Active phase OV-1
Column length (m) 1.8
Carrier gas N2
Substrate Gas Chrom Q (100-120 mesh)
Column diameter (mm)
Phase thickness (μm)
Temperature (C) 240.
I 2097.
ReferencePapp, Józan, et al., 1987
Comment MSDC-RI

References

Papp, Józan, et al., 1987
Papp, O.; Józan, M.; Szász, Gy.; Hermecz, I., Correlation Between Molar Refraction and Gas Chromatographic Retention Data, J. Chromatogr., 1987, 403, 11-18, https://doi.org/10.1016/S0021-9673(00)96336-2 . [all data]