1-Butanol, 2-ethyl-3-methyl, TMS

Kovats' RI, non-polar column, isothermal

View large format table.

Column type Active phase Temperature (C) I Reference Comment
CapillaryMethyl Silicone70.1005.Willis, 1986He; Column length: 61.0 m; Column diameter: 0.51 mm

References

Willis, 1986
Willis, D.E., Multidimensional Gas Chromatographic Analysis of Hexene Hydroformylation Products Using Support-Coated Open-Tubular Columns with Column Sequence Reversal (Foreflushing), J. Chromatogr. Sci., 1986, 24, 10, 417-422, https://doi.org/10.1093/chromsci/24.10.417 . [all data]