Methanimine, 1-(1-pyrrolidinyl), N-cyclohexyl

Kovats' RI, non-polar column, isothermal

Data compiled by: NIST Mass Spectrometry Data Center, William E. Wallace, director

Column type Packed
Active phase SE-30
Column length (m) 3.
Carrier gas N2
Substrate Chromosorb W AW (60-80 mesh)
Column diameter (mm)
Phase thickness (μm)
Temperature (C) 240.
I 1556.
ReferenceOsek, Oszczapowicz, et al., 1986
Comment MSDC-RI

References

Osek, Oszczapowicz, et al., 1986
Osek, J.; Oszczapowicz, J.; Drzewinski, W., Prediction of Retention Indices of N1,N1-Dialkylformamidines on a Non-Polar Column, J. Chromatogr., 1986, 351, 177-182, https://doi.org/10.1016/S0021-9673(01)83486-5 . [all data]