27-Nor-25-hydroxycholesterol, di-TMS

Kovats' RI, non-polar column, isothermal

Data compiled by: NIST Mass Spectrometry Data Center, William E. Wallace, director

Column type Packed
Active phase OV-1
Column length (m) 2.
Carrier gas N2
Substrate
Column diameter (mm)
Phase thickness (μm)
Temperature (C) 265.
I 3350.
ReferenceGaskell, Smith, et al., 1975
Comment MSDC-RI

References

Gaskell, Smith, et al., 1975
Gaskell, S.J.; Smith, A.G.; Brooks, C.J.W., Gas chromatography mass spectrometry of trimethylsilyl ethers of sidechain hydroxylated Δ4-3-ketosteroids. Long range trimethylsilyl group migration under electron impact, Biomed. Mass Spectrom., 1975, 2, 3, 148-155, https://doi.org/10.1002/bms.1200020309 . [all data]