4-Methyl-1,2,3,6-tetraacetylglucoside (B)

Kovats' RI, non-polar column, isothermal

Data compiled by: NIST Mass Spectrometry Data Center, William E. Wallace, director

Column type Capillary
Active phase OV-1
Column length (m) 15.
Carrier gas N2
Substrate
Column diameter (mm) 0.32
Phase thickness (μm)
Temperature (C) 170.
I 1834.
ReferenceZhu, 1985
Comment MSDC-RI

Van Den Dool and Kratz RI, non-polar column, temperature ramp

Data compiled by: NIST Mass Spectrometry Data Center, William E. Wallace, director

Column type CapillaryCapillary
Active phase OV-1OV-1
Column length (m) 15.15.
Carrier gas N2N2
Substrate
Column diameter (mm) 0.320.32
Phase thickness (μm)
Tstart (C) 150.150.
Tend (C) 180.180.
Heat rate (K/min) 2.2.
Initial hold (min)
Final hold (min)
I 1830.1843.
ReferenceZhu, 1985Zhu, 1985
Comment MSDC-RI MSDC-RI

References

Zhu, 1985
Zhu, A., Calculation of retention indices in temperature-programmed capillary gas chromatography, J. Chromatogr., 1985, 331, 229-235, https://doi.org/10.1016/0021-9673(85)80028-5 . [all data]