Octadecanoic acid, 9,10-dihydroxy, erythro, methyl ester, DTBS

Normal alkane RI, non-polar column, custom temperature program

View large format table.

Column type Active phase I Reference Comment
CapillaryOV-12750.Brooks, Cole, et al., 1984He; Column length: 25. m; Column diameter: 0.25 mm; Program: 80 0C (2 min) 30 0C/min -> 140 0C (2 min) 1.5 0C/min -> 200 0C; or: 80 0C (2 min) 30 0C/min -> 200 0C 2 0C/min -> 260 0C

References

Brooks, Cole, et al., 1984
Brooks, C.J.W.; Cole, W.J.; Barrett, G.M., Studies of cyclic Di-tert.-butylsilylene derivatives of diols and hydroxy acids by gas chromatography-mass spectrometry, J. Chromatogr., 1984, 315, 119-133, https://doi.org/10.1016/S0021-9673(01)90730-7 . [all data]