31-Norlanosterol acetate

Kovats' RI, non-polar column, isothermal

Data compiled by: NIST Mass Spectrometry Data Center, William E. Wallace, director

Column type Capillary
Active phase OV-1
Column length (m) 30.
Carrier gas N2
Substrate
Column diameter (mm) 0.30
Phase thickness (μm)
Temperature (C) 260.
I 3278.
ReferenceItoh, Tani, et al., 1982
Comment MSDC-RI

References

Itoh, Tani, et al., 1982
Itoh, T.; Tani, H.; Fukushima, K.; Tamura, T.; Matsumoto, T., Structure-Retention Relationship of Sterols and Triterpene Alcohols in Gas Chromatography on a Glass Capillary Column, J. Chromatogr., 1982, 234, 1, 65-76, https://doi.org/10.1016/S0021-9673(00)81781-1 . [all data]