trans-Tetralin-1,2-diol, diacetate

Kovats' RI, non-polar column, isothermal

Data compiled by: NIST Mass Spectrometry Data Center, William E. Wallace, director

Column type Packed
Active phase OV-1
Column length (m) 1.8
Carrier gas Helium or Nitrogen
Substrate Gas-Chrom Q (100-120 mesh)
Column diameter (mm) 0.25
Phase thickness (μm)
Temperature (C) 120.
I 1705.
ReferenceBrooks, Cole, et al., 1982
Comment MSDC-RI

References

Brooks, Cole, et al., 1982
Brooks, C.J.W.; Cole, W.J.; Borthwick, J.H.; Brown, G.M., Characterization of Dihydroarenediols and Related Compounds by Gas Chromatography-Mass Spectrometry: Comparison of Derivatives, J. Chromatogr., 1982, 239, 191-216, https://doi.org/10.1016/S0021-9673(00)81980-9 . [all data]