trans-Indan-1,2-diol, diacetate

Kovats' RI, non-polar column, isothermal

View large format table.

Column type Active phase Temperature (C) I Reference Comment
PackedOV-1120.1610.Brooks, Cole, et al., 1982Helium or Nitrogen, Gas-Chrom Q (100-120 mesh); Column length: 1.8 m; Column diameter: 0.25 mm

References

Brooks, Cole, et al., 1982
Brooks, C.J.W.; Cole, W.J.; Borthwick, J.H.; Brown, G.M., Characterization of Dihydroarenediols and Related Compounds by Gas Chromatography-Mass Spectrometry: Comparison of Derivatives, J. Chromatogr., 1982, 239, 191-216, https://doi.org/10.1016/S0021-9673(00)81980-9 . [all data]