5-Oxo-1-phenylacetyl-pyrrolidine-2-carboxylic acid methyl ester

Normal alkane RI, non-polar column, temperature ramp

Data compiled by: NIST Mass Spectrometry Data Center, William E. Wallace, director

Column type CapillaryCapillary
Active phase OV-101OV-101
Column length (m) 30.25.
Carrier gas H2He
Substrate
Column diameter (mm) 0.3
Phase thickness (μm)
Tstart (C) 80.75.
Tend (C) 275.280.
Heat rate (K/min) 2.2.
Initial hold (min) 7.7.
Final hold (min)
I 1988.1988.
ReferencePinkston, Spiteller, et al., 1981Spiteller and Spiteller, 1979
Comment MSDC-RI MSDC-RI

References

Pinkston, Spiteller, et al., 1981
Pinkston, D.; Spiteller, G.; von Henning, H.; Matthaei, D., High-resolution gas chromatography-mass spectrometry of the methyl esters of organic acids from uremic hemofiltrates, J. Chromatogr., 1981, 223, 1, 1-19, https://doi.org/10.1016/S0378-4347(00)80063-8 . [all data]

Spiteller and Spiteller, 1979
Spiteller, M.; Spiteller, G., Trennung und charakterisierung saurer harnbest and- teile, J. Chromatogr., 1979, 164, 3, 253-317, https://doi.org/10.1016/S0378-4347(00)81232-3 . [all data]