Zink dibutyldithiocarbamate

Kovats' RI, non-polar column, isothermal

Data compiled by: NIST Mass Spectrometry Data Center, William E. Wallace, director

Column type Packed
Active phase SE-30
Column length (m) 2.
Carrier gas
Substrate Gas-Chrom Q
Column diameter (mm)
Phase thickness (μm)
Temperature (C) 242.
I 3358.
ReferenceKrupcik, Leclercq, et al., 1979
Comment MSDC-RI

References

Krupcik, Leclercq, et al., 1979
Krupcik, J.; Leclercq, P.A.; Garaj, J.; Masaryk, J., Analysis of Divalent Metal Dialkyldithiocarbamates by Gas Chromatography and Mass Spectrometry, J. Chromatogr., 1979, 171, 285-304, https://doi.org/10.1016/S0021-9673(01)95308-7 . [all data]