allo-5B-Pregnan-3A,11B,21-triol-20-one, MO TMS

Van Den Dool and Kratz RI, non-polar column, temperature ramp

View large format table.

Column type Active phase I Reference Comment
PackedOV-1013030.Hurter and van Ree, 1979Gas-Chrom P (80-100 mesh), 1. K/min; Column length: 3.6 m; Tstart: 180. C
PackedSE-303011.Hurter and van Ree, 1979Gas-Chrom P (80-100 mesh), 1. K/min; Column length: 3.6 m; Tstart: 180. C

References

Hurter and van Ree, 1979
Hurter, P.; van Ree, T., Programmed-Temperature Gas Chromatography on Mixed Phases. Separation of Steroid Derivatives on Binary Mixtures, J. Chromatogr., 1979, 169, 93-100, https://doi.org/10.1016/0021-9673(75)85034-5 . [all data]