Prostaglandine F3A, methaneboronate

Kovats' RI, non-polar column, isothermal

View large format table.

Column type Active phase Temperature (C) I Reference Comment
PackedOV-1225.2590.Smith and Brooks, 1977N2, Gas Chrom Q; Column length: 2. m

References

Smith and Brooks, 1977
Smith, A.G.; Brooks, C.J.W., Gas Chromatography Chemical Ionization Mass Spectrometry of Prostaglandin Fα Cyclic Boronate Derivatives, Biomed. Mass Spectrom., 1977, 4, 4, 258-264, https://doi.org/10.1002/bms.1200040413 . [all data]