p-menthane, 1,8-dinitro-

Phase change data

Data compiled by: Thermodynamics Research Center, NIST Boulder Laboratories, Chris Muzny director

Quantity Value Units Method Reference Comment
Tfus378.15KN/AKornblum, Clutter, et al., 1956Uncertainty assigned by TRC = 2. K; presumably a mixture of cis and trans isomers

In addition to the Thermodynamics Research Center (TRC) data available from this site, much more physical and chemical property data is available from the following TRC products:

References

Kornblum, Clutter, et al., 1956
Kornblum, N.; Clutter, R.J.; Jones, W.J., Synthesis of Tertiary Nitroparaffins, J. Am. Chem. Soc., 1956, 78, 4003. [all data]