Phenol, 2-methyl-4-nitro-

Kovats' RI, non-polar column, isothermal

View large format table.

Column type Active phase Temperature (C) I Reference Comment
PackedE-301150.1588.Verevkin, Belen'kaya, et al., 1990He; Column length: 1.0 m
PackedSE-30204.1571.Mitchell and Vernon, 1972
PackedApiezon L204.1644.Mitchell and Vernon, 1972
PackedSE-52204.1665.Mitchell and Vernon, 1972

Gas phase ion energetics data

Data compiled by: John E. Bartmess

De-protonation reactions

C7H6NO3- + Hydrogen cation = Phenol, 2-methyl-4-nitro-

By formula: C7H6NO3- + H+ = C7H7NO3

Quantity Value Units Method Reference Comment
Δr328.6 ± 2.2kcal/molG+TSFujio, McIver, et al., 1981gas phase; value altered from reference due to change in acidity scale
Quantity Value Units Method Reference Comment
Δr321.0 ± 2.0kcal/molIMREFujio, McIver, et al., 1981gas phase; value altered from reference due to change in acidity scale

Reaction thermochemistry data

Data compiled by: John E. Bartmess

Individual Reactions

C7H6NO3- + Hydrogen cation = Phenol, 2-methyl-4-nitro-

By formula: C7H6NO3- + H+ = C7H7NO3

Quantity Value Units Method Reference Comment
Δr328.6 ± 2.2kcal/molG+TSFujio, McIver, et al., 1981gas phase; value altered from reference due to change in acidity scale
Quantity Value Units Method Reference Comment
Δr321.0 ± 2.0kcal/molIMREFujio, McIver, et al., 1981gas phase; value altered from reference due to change in acidity scale

References

Verevkin, Belen'kaya, et al., 1990
Verevkin, S.P.; Belen'kaya, R.S.; Rozhnov, A.M.; Matyushina, V.P., Investigation of the chromatographic behaviour of alkylnitrophenols, Zh. Anal. Khim., 1990, 45, 1786-1790. [all data]

Mitchell and Vernon, 1972
Mitchell, P.T.; Vernon, F., Gas-Liquid Chromatography of Nitrophenols and Methyl Derivatives, J. Chromatogr., 1972, 65, 3, 487-491, https://doi.org/10.1016/S0021-9673(00)84994-8 . [all data]