Cyclohexanol, 1-methoxy-3-methylene-, (+-)-

Gas phase ion energetics data

Data compiled by: Sharon G. Lias, John E. Bartmess, Joel F. Liebman, John L. Holmes, Rhoda D. Levin, and W. Gary Mallard

Ionization energy determinations

IE (eV) Method Reference Comment
8.7PELambert, Xue, et al., 1986
9.17PELambert, Xue, et al., 1986Vertical value

References

Lambert, Xue, et al., 1986
Lambert, J.B.; Xue, L.; Bosch, R.J.; Taba, K.M.; Marko, D.E.; Urano, S.; LeBreton, P.R., Through space interactions of double bonds by photoelectron spectroscopy, J. Am. Chem. Soc., 1986, 108, 7575. [all data]