1-Bis(tert-butyldimethylsilyloxy)phosphoryl-N-(tert-butyldimethylsilyl)methanamine

Van Den Dool and Kratz RI, non-polar column, temperature ramp

View large format table.

Column type Active phase I Reference Comment
CapillaryVF-5MS2091.N/A30. m/0.25 mm/0.25 μm, He; Tstart: 60. C; Tend: 270. C

Normal alkane RI, non-polar column, temperature ramp

View large format table.

Column type Active phase I Reference Comment
CapillaryDB-12100.Tsunoda, 199330. m/0.24 mm/0.25 μm, He, 8. K/min, 300. C @ 5. min; Tstart: 100. C

References

Tsunoda, 1993
Tsunoda, N., Simultaneous determination of the herbicides glyphosate, glufosinate and bialaphos and their metabolites by capillary gas chromatography-ion-trap mass spectrometry, J. Chromatogr., 1993, 637, 2, 167-173, https://doi.org/10.1016/0021-9673(93)83209-B . [all data]