Formamide, N-(2-methylphenyl)-

Normal alkane RI, non-polar column, temperature ramp

Data compiled by: NIST Mass Spectrometry Data Center, William E. Wallace, director

Column type CapillaryCapillary
Active phase VF-5 MSVF-5 MS
Column length (m) 60.60.
Carrier gas HeliumHelium
Substrate
Column diameter (mm) 0.320.32
Phase thickness (μm) 0.250.25
Tstart (C) 30.30.
Tend (C) 260.260.
Heat rate (K/min) 2.2.
Initial hold (min)
Final hold (min) 28.28.
I 1282.1283.
ReferenceLeffingwell and Alford, 2011Leffingwell and Alford, 2011
Comment MSDC-RI MSDC-RI

References

Leffingwell and Alford, 2011
Leffingwell, J.; Alford, E.D., Volatile constituents of the giant pufball mushroom (Calvatia gigantea), Leffingwell Rep., 2011, 4, 1-17. [all data]