Geranyl benzoate

Kovats' RI, non-polar column, temperature ramp

Data compiled by: NIST Mass Spectrometry Data Center, William E. Wallace, director

Column type Capillary
Active phase BP-1
Column length (m) 25.
Carrier gas N2
Substrate
Column diameter (mm) 0.55
Phase thickness (μm) 0.25
Tstart (C) 60.
Tend (C) 220.
Heat rate (K/min) 5.
Initial hold (min)
Final hold (min) 15.
I 1952.
ReferenceRaina, Srivastava, et al., 2001
Comment MSDC-RI

Van Den Dool and Kratz RI, non-polar column, temperature ramp

Data compiled by: NIST Mass Spectrometry Data Center, William E. Wallace, director

Column type Capillary
Active phase BP-1
Column length (m) 30.
Carrier gas N2
Substrate
Column diameter (mm) 0.32
Phase thickness (μm) 0.25
Tstart (C) 60.
Tend (C) 220.
Heat rate (K/min) 5.
Initial hold (min)
Final hold (min) 13.
I 1951.
ReferenceRaina, Kumar, et al., 2004
Comment MSDC-RI

Kovats' RI, non-polar column, custom temperature program

View large format table.

Column type Active phase I Reference Comment
CapillaryBP-11937.Khan, Verma, et al., 200630. m/0.32 mm/0.25 μm, N2; Program: 60C => 5C/min => 220C (5min) => 3C/min => 245C(5min)

Normal alkane RI, non-polar column, temperature ramp

View large format table.

Column type Active phase I Reference Comment
CapillaryHP-51978.Wang, Yang, et al., 200630. m/0.25 mm/0.25 μm, He, 60. C @ 2. min, 10. K/min, 250. C @ 10. min

Normal alkane RI, non-polar column, custom temperature program

View large format table.

Column type Active phase I Reference Comment
CapillaryCP Sil 8 CB1949.Kristiawan, Sobolik, et al., 200830. m/0.25 mm/0.25 μm; Program: 60C => 2.5C/min => 170C => 10C/min => 250C (5min)
CapillarySE-301949.Vinogradov, 2004Program: not specified

Normal alkane RI, polar column, custom temperature program

View large format table.

Column type Active phase I Reference Comment
CapillaryHP-Innowax FSC2617.Kamariah, Lim, et al., 199960. m/0.25 mm/0.25 μm, He; Program: 60C(10min) => 4C/min => 220C(10min) => 1C/min => 240C(20min)

References

Raina, Srivastava, et al., 2001
Raina, V.K.; Srivastava, S.K.; Aggarwal, K.K.; Ramesh, S.; Kumar, S., Essential oil composition of Cinnamomum zeylanicum Blume leaves from Little Andaman, India, Flavour Fragr. J., 2001, 16, 5, 374-376, https://doi.org/10.1002/ffj.1016 . [all data]