Benzoic acid, 2-phenylethyl ester

Kovats' RI, non-polar column, isothermal

View large format table.

Column type Active phase Temperature (C) I Reference Comment
CapillarySE-30140.1796.Korhonen, 1986N2; Column length: 25. m; Column diameter: 0.33 mm
CapillarySE-30160.1809.Korhonen, 1986N2; Column length: 25. m; Column diameter: 0.33 mm
CapillarySE-30180.1825.Korhonen, 1986N2; Column length: 25. m; Column diameter: 0.33 mm
CapillarySE-30180.1825.Korhonen, 1986N2; Column length: 25. m; Column diameter: 0.33 mm
CapillarySE-30200.1836.Korhonen, 1986N2; Column length: 25. m; Column diameter: 0.33 mm
CapillarySE-30220.1849.Korhonen, 1986N2; Column length: 25. m; Column diameter: 0.33 mm
CapillarySE-30240.1863.Korhonen, 1986N2; Column length: 25. m; Column diameter: 0.33 mm

Kovats' RI, non-polar column, temperature ramp

View large format table.

Column type Active phase I Reference Comment
CapillaryMethyl Silicone1818.Jayaprakasha, Rao, et al., 200030. m/0.32 mm/0.25 μm, He, 60. C @ 2. min, 2. K/min, 225. C @ 5. min

Kovats' RI, polar column, isothermal

View large format table.

Column type Active phase Temperature (C) I Reference Comment
CapillaryOV-351160.2621.Korhonen, 1986N2; Column length: 25. m; Column diameter: 0.32 mm
CapillaryOV-351180.2652.Korhonen, 1986N2; Column length: 25. m; Column diameter: 0.32 mm
CapillaryOV-351180.2652.Korhonen, 1986N2; Column length: 25. m; Column diameter: 0.32 mm
CapillaryOV-351200.2682.Korhonen, 1986N2; Column length: 25. m; Column diameter: 0.32 mm

Van Den Dool and Kratz RI, non-polar column, temperature ramp

View large format table.

Column type Active phase I Reference Comment
CapillaryDB-51860.Rout, Rao, et al., 200725. m/0.25 mm/0.25 μm, He, 2. K/min, 200. C @ 60. min; Tstart: 60. C
CapillarySPB-51859.Pino, Marbot, et al., 200430. m/0.25 mm/0.25 μm, He, 60. C @ 2. min, 4. K/min, 250. C @ 20. min
CapillaryBP-11848.Raina, Kumar, et al., 200430. m/0.32 mm/0.25 μm, N2, 5. K/min, 220. C @ 13. min; Tstart: 60. C
CapillaryDB-11829.Stashenko, Prada, et al., 199660. m/0.25 mm/0.25 μm, He, 50. C @ 5. min, 3.5 K/min; Tend: 250. C
CapillarySE-301815.Korhonen, 1986N2, 6. K/min; Column length: 25. m; Column diameter: 0.33 mm; Tstart: 100. C
CapillarySE-301828.Korhonen, 1986N2, 10. K/min; Column length: 25. m; Column diameter: 0.33 mm; Tstart: 50. C

Van Den Dool and Kratz RI, non-polar column, custom temperature program

View large format table.

Column type Active phase I Reference Comment
CapillaryHP-5MS1858.9Andriamaharavo, 201430. m/0.25 mm/0.25 μm, He; Program: 60C (1 min) => 5 C/min => 210C => 10 C/min => 280C (15 min)

Van Den Dool and Kratz RI, polar column, temperature ramp

View large format table.

Column type Active phase I Reference Comment
CapillaryOV-3512668.Korhonen, 1986N2, 10. K/min; Column length: 25. m; Column diameter: 0.32 mm; Tstart: 50. C; Tend: 220. C
CapillaryOV-3512654.Korhonen, 1986N2, 6. K/min; Column length: 25. m; Column diameter: 0.32 mm; Tstart: 50. C; Tend: 220. C

Normal alkane RI, non-polar column, temperature ramp

View large format table.

Column type Active phase I Reference Comment
CapillaryRTX-5 MS1844.Edris, Chizzola, et al., 200730. m/0.25 mm/0.25 μm, He, 60. C @ 2. min, 2. K/min, 200. C @ 10. min
CapillaryHP-1011823.Mastelic, Jerkovic, et al., 200625. m/0.2 mm/0.2 μm, He, 70. C @ 2. min, 3. K/min, 200. C @ 15. min
CapillaryDB-51854.Rout, Naik, et al., 200630. m/0.25 mm/0.25 μm, He, 2. K/min, 200. C @ 60. min; Tstart: 60. C
CapillaryDB-11841.Tohar, Mohd, et al., 200630. m/0.32 mm/0.25 μm, 60. C @ 3. min, 3. K/min, 230. C @ 10. min
CapillaryRSL-2001841.Jirovetz, Buchbauer, et al., 200230. m/0.32 mm/0.25 μm, H2, 40. C @ 5. min, 6. K/min, 280. C @ 5. min

Normal alkane RI, non-polar column, custom temperature program

View large format table.

Column type Active phase I Reference Comment
CapillaryDB-51841.Yusuf and Bewaji, 2011Column length: 30. m; Column diameter: 0.32 mm; Program: not specified
CapillaryRTX-51858.Leela, Vipin, et al., 200930. m/0.25 mm/0.25 μm, Nitrogen; Program: 60 0C 95 min) 110 0C 3 0C/min -> 200 0C 5 0C/min -> 220 0C 95 min)
CapillaryHP-5MS1841.Liu, Song, et al., 200730. m/0.25 mm/0.25 μm, He; Program: 40C(3min) => 8C/min => 160C => 15C/min => 300C (10min)
CapillaryPolydimethyl siloxane with 5 % Ph groups1859.Pino, Marbot, et al., 2005Program: not specified
CapillarySE-301841.Vinogradov, 2004Program: not specified
CapillaryPolydimethyl siloxanes1825.Zenkevich and Chupalov, 1996Program: not specified

References

Korhonen, 1986
Korhonen, I.O.O., Gas-Liquid Chromatographic Analyses. XLVIII. Benzyl, (±)-1-Phenylethyl and 2-Phenylethyl Alcohols and the Corresponding Esters of Benzoic Acid and Its 2-, 3- and 4-Chloro, Pentafluoro, 4-Nitro and 3,5-Dinitro Derivatives on SE-30 and OV-351 Capillary Columns, J. Chromatogr., 1986, 363, 277-292. [all data]

Jayaprakasha, Rao, et al., 2000
Jayaprakasha, G.K.; Rao, L.J.M.; Sakariah, K.K., Chemical composition of the flower oil of Cinnamomum zeylanicum blume, J. Agric. Food Chem., 2000, 48, 9, 4294-4295, https://doi.org/10.1021/jf991395c . [all data]

Rout, Rao, et al., 2007
Rout, P.K.; Rao, Y.R.; Sree., A.; Naik, S.N., Composition of essential oil, concrete, absolute, wax and headspace volatiles of Murrarya paniculata (Linn.) Jack flowers, Flavour Fragr. J., 2007, 22, 5, 352-357, https://doi.org/10.1002/ffj.1804 . [all data]

Pino, Marbot, et al., 2004
Pino, J.A.; Marbot, R.; Rosado, A.; Vázquez, C., Volatile constituents of Malay rose apple [Syzygium malaccense (L.) Merr. Perry], Flavour Fragr. J., 2004, 19, 1, 32-35, https://doi.org/10.1002/ffj.1269 . [all data]

Raina, Kumar, et al., 2004
Raina, V.K.; Kumar, A.; Srivastava, S.K.; Syamsundar, K.V.; Kahol, A.P., Essential oil composition of 'kewda' (Pandanus odoratissimus) from India, Flavour Fragr. J., 2004, 19, 5, 434-436, https://doi.org/10.1002/ffj.1331 . [all data]

Stashenko, Prada, et al., 1996
Stashenko, E.E.; Prada, N.Q.; Martínez, J.R., HRGC/FID/NP and HRGC/MSD study of Colombian Ylang-Ylang (Cananga odorata) oils obtained by different extraction techniques, J. Hi. Res. Chromatogr., 1996, 19, 6, 353-358, https://doi.org/10.1002/jhrc.1240190609 . [all data]

Andriamaharavo, 2014
Andriamaharavo, N.R., Retention Data. NIST Mass Spectrometry Data Center., NIST Mass Spectrometry Data Center, 2014. [all data]

Edris, Chizzola, et al., 2007
Edris, A.E.; Chizzola, R.; Franz, C., Isolation and characterization of the volatile aroma compounds from the concrete headspace and the absolute of Jasminum sambac (L.) Ait. (Oleaceae) flowers grown in Egypt, Eur. Food Res. Technol., 2007, https://doi.org/10.1007/s00217-007-0623-y . [all data]

Mastelic, Jerkovic, et al., 2006
Mastelic, J.; Jerkovic, I.; Mesic, M., Volatile constituents from flowers, leaves, bark and wood of Prunus mahaleb L., Flavour Fragr. J., 2006, 21, 2, 306-313, https://doi.org/10.1002/ffj.1596 . [all data]

Rout, Naik, et al., 2006
Rout, P.K.; Naik, S.N.; Rao, Y.R., Composition of the concrete, absolute, headspace and essential oil of the flowers of Michelia champaca Linn., Flavour Fragr. J., 2006, 21, 6, 906-911, https://doi.org/10.1002/ffj.1742 . [all data]

Tohar, Mohd, et al., 2006
Tohar, N.; Mohd, M.A.; Jantan, I.; Awang, K., A comparative study of the essential oils of the genus Plumeria Linn. from Malaysia, Flavour Fragr. J., 2006, 21, 6, 859-863, https://doi.org/10.1002/ffj.1617 . [all data]

Jirovetz, Buchbauer, et al., 2002
Jirovetz, L.; Buchbauer, G.; Ngassoum, M.B.; Geissler, M., Aroma compound analysis of Piper nigrum and Piper guineense essential oils from Cameroon using solid-phase microextraction-gas chromatography, solid-phase microextraction-gas chromatography-mass spectrometry and olfactometry, J. Chromatogr. A, 2002, 976, 1-2, 265-275, https://doi.org/10.1016/S0021-9673(02)00376-X . [all data]

Yusuf and Bewaji, 2011
Yusuf, O.K.; Bewaji, C.O., Evaluation of essential oils composition of methanolic Allium sativum extract on Trypanosoma brucei infected rats, Res. Pharmaceutical Biotechnol., 2011, 3, 2, 17-21. [all data]

Leela, Vipin, et al., 2009
Leela, N.K.; Vipin, T.M.; Shafeekh, K.M.; Priyanka, V.; Rema, J., Chemical composition of essential oils from aerial parts of Cinnamomum malabatrum (Burman f.) Bercht Presl., Flavor Fragr. J., 2009, 24, 1, 13-16, https://doi.org/10.1002/ffj.1910 . [all data]

Liu, Song, et al., 2007
Liu, L.; Song, G.; Hu, Y., GC?MS Analysis of the Essential Oils of Piper nigrum L. and Piper longum L., Chromatographia, 2007, 66, 9-10, 785-790, https://doi.org/10.1365/s10337-007-0408-2 . [all data]

Pino, Marbot, et al., 2005
Pino, J.A.; Marbot, R.; Rosado, A.; Vázquez, C., Volatile constituents of Malay rose apple [Syzygium malaccense (L.) Merr. Perry], Flavour Fragr. J., 2005, 20, 98-100. [all data]

Vinogradov, 2004
Vinogradov, B.A., Production, composition, properties and application of essential oils, 2004, retrieved from http://viness.narod.ru. [all data]

Zenkevich and Chupalov, 1996
Zenkevich, I.G.; Chupalov, A.A., New Possibilities of Chromato Mass Pectrometric Identification of Organic Compounds Using Increments of Gas Chromatographic Retention Indices of Molecular Structural Fragments, Zh. Org. Khim. (Rus.), 1996, 32, 5, 656-666. [all data]