2-Propenoic acid, 3-(4-methoxyphenyl)-, (E)-

Phase change data

Data compiled by: William E. Acree, Jr., James S. Chickos

Quantity Value Units Method Reference Comment
Δsub32.03 ± 0.24kcal/molMEMonte and Hillesheim, 1999Based on data from 369. - 383. K.

References

Monte and Hillesheim, 1999
Monte, Manuel J.S.; Hillesheim, Dorothea M., Vapour pressures, enthalpies and entropies of sublimation of trans -cinnamic acid and of nine methoxy and dimethoxycinnamic acids, The Journal of Chemical Thermodynamics, 1999, 31, 11, 1443-1456, https://doi.org/10.1006/jcht.1999.0540 . [all data]