Ethyl-(4-n-butylamino)benzoate

Normal alkane RI, non-polar column, isothermal

View large format table.

Column type Active phase Temperature (C) I Reference Comment
CapillaryJXR200.2148.von Buchi, Lorini, et al., 1972
CapillaryJXR220.2158.von Buchi, Lorini, et al., 1972
CapillaryJXR240.2170.von Buchi, Lorini, et al., 1972

References

von Buchi, Lorini, et al., 1972
von Buchi, J.; Lorini, V.; Perlia, X., Gaschromatographische Untersuchung einiger homologer Reihen von Lokalanaesthetica, Pharm. Acta Helv., 1972, 47, 65, 377-393. [all data]