1,3-Isobenzofurandione, 5,6-dichloro-

Gas phase ion energetics data

Data compiled by: Henry M. Rosenstock, Keith Draxl, Bruce W. Steiner, and John T. Herron

Appearance energy determinations

Ion AE (eV) Other Products MethodReferenceComment
C6H2Cl2+14.1 ± 0.2?EIGrutzmacher and Hubner, 1969

References

Grutzmacher and Hubner, 1969
Grutzmacher, H.-F.; Hubner, J., Massenspektrometrie instabiler molekule. III: Nachweis und untersuchungen zur stabilitat chlorsubstituierter dehydrobenzole in der gasphase, Org. Mass Spectrom., 1969, 2, 649. [all data]