(E)-3-(2-Methylphenyl)-2-propenoic acid

Gas phase ion energetics data

Data compiled as indicated in comments:
LBLHLM - Sharon G. Lias, John E. Bartmess, Joel F. Liebman, John L. Holmes, Rhoda D. Levin, and W. Gary Mallard

Ionization energy determinations

IE (eV) Method Reference Comment
8.65EISchaldach, 1984LBLHLM

References

Schaldach, 1984
Schaldach, B., Chemistry of gaseous ions. Part VIII. Bond strength and mass spectrometric fragmentation of 2-methoxycinnamic acid, Int. J. Mass Spectrom. Ion Processes, 1984, 56, 237. [all data]