Quinoline, 8-methoxy-

Phase change data

Data compiled by: Thermodynamics Research Center, NIST Boulder Laboratories, Chris Muzny director

Quantity Value Units Method Reference Comment
Tfus318.4KN/AEwing and Steck, 1946Uncertainty assigned by TRC = 0.7 K

In addition to the Thermodynamics Research Center (TRC) data available from this site, much more physical and chemical property data is available from the following TRC products:

References

Ewing and Steck, 1946
Ewing, G.W.; Steck, E.A., Absorption spectra of heterocyclic compounds I. Quinolinols and isoquinolinols, J. Am. Chem. Soc., 1946, 68, 2181. [all data]