Cyclohexanol, 4-(1,1-dimethylethyl)-, cis-

Gas phase ion energetics data

Data compiled by: Sharon G. Lias, Rhoda D. Levin, and Sherif A. Kafafi

Ionization energy determinations

IE (eV) Method Reference Comment
9.82 ± 0.02PEBrown, Marcinko, et al., 1979Vertical value

Kovats' RI, non-polar column, isothermal

View large format table.

Column type Active phase Temperature (C) I Reference Comment
PackedApiezon L130.1225.Paris and Alexandre, 1972Chromosorb W AW

Phase change data

Data compiled by: Thermodynamics Research Center, NIST Boulder Laboratories, Chris Muzny director

Quantity Value Units Method Reference Comment
Tfus355.9KN/AEliel and Jola, 1969Uncertainty assigned by TRC = 3. K
Tfus354.2KN/AWinstein and Holness, 1955Uncertainty assigned by TRC = 3. K
Tfus356.KN/AWinstein and Holness, 1955Uncertainty assigned by TRC = 4. K

In addition to the Thermodynamics Research Center (TRC) data available from this site, much more physical and chemical property data is available from the following TRC products:

References

Brown, Marcinko, et al., 1979
Brown, R.S.; Marcinko, R.W.; Tse, A., Application of photoelectron spectroscopy to substituent effects. Conformational analysis of some flexible allylic ethers and alcohols, Can. J. Chem., 1979, 57, 1890. [all data]