Creosol

Kovats' RI, polar column, temperature ramp

View large format table.

Column type Active phase I Reference Comment
CapillarySupelcowax-101972.Wong and Teng, 1994He, 35. C @ 5. min, 3. K/min, 200. C @ 20. min; Column length: 60. m; Column diameter: 0.25 mm

Van Den Dool and Kratz RI, non-polar column, temperature ramp

View large format table.

Column type Active phase I Reference Comment
CapillaryBP-11162.Duquesnoy, Dinh, et al., 200650. m/0.22 mm/0.25 μm, He, 2. K/min, 220. C @ 20. min; Tstart: 60. C
CapillaryCP Sil 8 CB1187.Chevance and Farmer, 199960. C @ 5. min, 4. K/min, 220. C @ 30. min; Column length: 50. m; Column diameter: 0.32 mm
CapillaryCP Sil 8 CB1185.Chevance and Farmer, 199960. C @ 5. min, 4. K/min, 220. C @ 30. min; Column length: 50. m; Column diameter: 0.32 mm
CapillaryDB-11155.Stashenko, Prada, et al., 199660. m/0.25 mm/0.25 μm, He, 50. C @ 5. min, 3.5 K/min; Tend: 250. C

Van Den Dool and Kratz RI, non-polar column, custom temperature program

View large format table.

Column type Active phase I Reference Comment
CapillaryDB-5MS1192.Varlet, Serot, et al., 200730. m/0.32 mm/0.5 μm, He; Program: 70C => 5C/min => 85C(1min) => 3C/min => 165C => 10C/min => 280C(3min)
CapillaryDB-5MS1192.Varlet V., Knockaert C., et al., 200630. m/0.32 mm/0.5 μm, He; Program: 70C(1min) => 3C/min => 80C(1min) => 5C/min => 150C => 10C/min => 280C (4min)
CapillaryLM-51192.6Ré-Poppi and Santiago-Silva, 200530. m/0.25 mm/0.25 μm, He; Program: 60C(2min) => 15C/min => 180C => 5C/min => 280C (10min)
CapillaryLM-51195.5Ré-Poppi and Santiago-Silva, 200230. m/0.25 mm/0.25 μm, He; Program: 60C(2min) => 15C/min => 180C => 5C/min => 280C(5min)
CapillaryDB-5MS1181.Boulanger and Crouzet, 200030. m/0.25 mm/0.25 μm, H2/N2; Program: 40C (5min) => 2C/min => 200C => 5C/min => 250C (15min)
CapillaryDB-51157.Boulanger, Chassagne, et al., 199930. m/0.25 mm/0.25 μm, H2; Program: 40C(5min) => 2C/min => 220C => 5C/min => 250C(15min)
CapillaryDB-51193.Boulanger, Chassagne, et al., 199930. m/0.25 mm/0.25 μm, H2; Program: 40C(5min) => 2C/min => 220C => 5C/min => 250C(15min)

Van Den Dool and Kratz RI, polar column, temperature ramp

View large format table.

Column type Active phase I Reference Comment
CapillaryBP-201938.Duquesnoy, Dinh, et al., 200650. m/0.22 mm/0.25 μm, He, 2. K/min, 220. C @ 20. min; Tstart: 60. C
CapillaryZB-Wax1960.Ledauphin, Saint-Clair, et al., 200430. m/0.25 mm/0.15 μm, He, 35. C @ 10. min, 1.8 K/min, 220. C @ 10. min
CapillaryCP-Wax 52CB1945.Chevance and Farmer, 199960. C @ 5. min, 4. K/min, 220. C @ 30. min; Column length: 50. m; Column diameter: 0.32 mm
CapillaryCP-Wax 52CB1938.Chevance and Farmer, 199960. C @ 5. min, 4. K/min, 220. C @ 30. min; Column length: 50. m; Column diameter: 0.32 mm
CapillaryCP-Wax 52CB1934.Chevance and Farmer, 1999, 240. C @ 5. min, 4. K/min, 220. C @ 30. min; Column length: 50. m; Column diameter: 0.32 mm
CapillaryCP-Wax 52CB1949.Chevance and Farmer, 1999, 260. C @ 5. min, 4. K/min, 220. C @ 30. min; Column length: 50. m; Column diameter: 0.32 mm
CapillaryCP-Wax 52CB1957.Chevance and Farmer, 1999, 240. C @ 5. min, 4. K/min, 220. C @ 30. min; Column length: 50. m; Column diameter: 0.32 mm
CapillaryHP-Wax1996.Christensen, Jakobsen, et al., 199750. m/0.2 mm/0.4 μm, He, 30. C @ 1. min, 5. K/min, 220. C @ 30. min
CapillaryDB-Wax1956.Shiratsuchi, Shimoda, et al., 199360. m/0.25 mm/0.25 μm, 50. C @ 4. min, 2. K/min, 230. C @ 30. min

Van Den Dool and Kratz RI, polar column, custom temperature program

View large format table.

Column type Active phase I Reference Comment
CapillaryStabilwax1969.Natali N., Chinnici F., et al., 200630. m/0.25 mm/0.25 μm, He; Program: 40C => 3C/min => 100C => 5C/min => 240C(10min)

Normal alkane RI, non-polar column, temperature ramp

View large format table.

Column type Active phase I Reference Comment
CapillaryVF-5 MS1198.Souza, Re-Poppi, et al., 201230. m/0.25 mm/0.25 μm, Helium, 60. C @ 1. min, 6. K/min, 280. C @ 3. min
CapillaryHP-5 MS1199.Jerkovic, Hegic, et al., 201030. m/0.25 mm/0.25 μm, Helium, 70. C @ 2. min, 3. K/min, 200. C @ 18. min
CapillaryDB-5 MS1210.Majcher, Lawrowski, et al., 201025. m/0.20 mm/0.33 μm, Helium, 40. C @ 1. min, 10. K/min; Tend: 250. C
CapillaryDB-51195.Fan and Qian, 200630. m/0.32 mm/1. μm, N2, 40. C @ 2. min, 6. K/min, 230. C @ 15. min
CapillaryDB-11162.Lee, Lee, et al., 200560. m/0.32 mm/0.25 μm, He, 35. C @ 4. min, 2. K/min, 230. C @ 25. min
CapillaryDB-11164.Lee, Lee, et al., 200560. m/0.32 mm/0.25 μm, He, 35. C @ 4. min, 2. K/min, 230. C @ 25. min
CapillaryDB-11159.Park, Lee, et al., 200460. m/0.32 mm/0.25 μm, He, 35. C @ 4. min, 2. K/min, 230. C @ 25. min
CapillaryDB-11161.Park, Lee, et al., 200460. m/0.32 mm/0.25 μm, He, 35. C @ 4. min, 2. K/min, 230. C @ 25. min
CapillaryDB-11161.Park, Lee, et al., 200460. m/0.32 mm/0.25 μm, He, 35. C @ 4. min, 2. K/min, 230. C @ 25. min
CapillaryDB-11164.Park, Lee, et al., 200460. m/0.32 mm/0.25 μm, He, 35. C @ 4. min, 2. K/min, 230. C @ 25. min
CapillarySPB-51200.Poligné, Collignan, et al., 200160. m/0.32 mm/1. μm, He, 3. K/min; Tstart: 40. C; Tend: 200. C
CapillaryDB-11160.Kjällstrand, Ramnäs, et al., 199830. m/0.25 mm/0.25 μm, He, 5. K/min; Tstart: 50. C; Tend: 200. C
CapillaryDB-11158.Stashenko, Torres, et al., 199560. m/0.25 mm/0.25 μm, He, 50. C @ 5. min, 3.5 K/min; Tend: 250. C
CapillaryDB-11169.Shiota, 199330. m/0.25 mm/0.25 μm, He, 50. C @ 3. min, 5. K/min; Tend: 240. C
CapillaryDB-11171.Shiota, 199330. m/0.25 mm/0.25 μm, He, 50. C @ 3. min, 5. K/min; Tend: 240. C

Normal alkane RI, non-polar column, custom temperature program

View large format table.

Column type Active phase I Reference Comment
CapillarySLB-5 MS1190.Mondello, 201230. m/0.25 mm/0.25 μm, Helium; Program: not specified
CapillarySLB-5 MS1194.Mondello, 201230. m/0.25 mm/0.25 μm, Helium; Program: not specified
CapillaryPolydimethyl siloxane with 5 % Ph groups1188.Robinson, Adams, et al., 2012Program: not specified
CapillaryPolydimethyl siloxane with 5 % Ph groups1203.Robinson, Adams, et al., 2012Program: not specified
CapillaryVF-5 MS1197.Souza, Re-Poppi, et al., 201230. m/0.25 mm/0.25 μm, Helium; Program: not specified
CapillaryZB-51191.de Simon, Estruelas, et al., 200930. m/0.25 mm/0.25 μm, Helium; Program: 45 0C 3 0C/min -> 230 0C (10 min) 10 0C/min -> 270 0C (21 min)
CapillaryHP-51193.Zhao, Li, et al., 200830. m/0.25 mm/0.25 μm; Program: 40 0C (2 min) 5 0C/min -> 80 0C 7 oC/min -> 160 0C 9 0C/min -> 200 0C 20 0C/min -> 280 0C (10 min)
CapillaryHP-51192.Zhao, Li, et al., 200830. m/0.25 mm/0.25 μm; Program: not specified
CapillaryPolydimethyl siloxane1160.RAyne and Eggers, 2007Program: not specified
CapillaryDB-11166.Sung, Stone, et al., 2007Helium; Column length: 30. m; Column diameter: 0.25 mm; Program: 120 0C (2 min( 5 0C/min -> 200 0C 10 0C/min -> 290 0C (5 min)
CapillaryDB-51191.Hamm, Bleton, et al., 200430. m/0.25 mm/0.25 μm, He; Program: 40C(1min) => 9C/min => 130C => 2C/min => 230C
CapillaryDB-5MS1191.Fu, Yoon, et al., 2002Program: not specified
CapillaryMethyl phenyl siloxane (not specified)1198.Poligne, Collignan, et al., 2002Program: not specified
CapillaryHP-5MS1192.Ansorena, Gimeno, et al., 200130. m/0.25 mm/0.25 μm, He; Program: 40C (10min) => 3C/min => 120C => 10C/min => 250C (5min)
CapillaryHP-51190.Ansorena, Astiasarán, et al., 200030. m/0.25 mm/0.25 μm, He; Program: 40C (10min) => 3C/min => 120C => 10C/min => 250C (5min)
CapillaryDB-51207.Mateo and Zumalacárregui, 199650. m/0.32 mm/0.25 μm, He; Program: 40C (10min) => 3C/min => 95C => 10C/min => 270C (10min)

Normal alkane RI, polar column, temperature ramp

View large format table.

Column type Active phase I Reference Comment
CapillaryAT-Wax1980.Kiss, Csoka, et al., 201160. m/0.25 mm/0.25 μm, Helium, 4. K/min; Tstart: 60. C; Tend: 280. C
CapillaryAT-Wax1967.Kiss, Csoka, et al., 201160. m/0.25 mm/0.25 μm, Helium, 4. K/min; Tstart: 60. C; Tend: 280. C
CapillaryDB-Wax1959.Zhao, Xu, et al., 200930. m/0.25 mm/0.25 μm, Helium, 40. C @ 2. min, 3. K/min, 230. C @ 5. min
CapillaryDB-Wax1956.Fan and Qian, 200630. m/0.32 mm/0.25 μm, N2, 40. C @ 2. min, 6. K/min, 230. C @ 15. min
CapillaryPEG-20M1970.Yao, Guo, et al., 200560. C @ 10. min, 3. K/min, 180. C @ 30. min; Column length: 30. m; Column diameter: 0.25 mm
CapillaryTC-Wax1968.Miyazawa and Okuno, 2003He, 4. K/min, 250. C @ 30. min; Column length: 60. m; Column diameter: 0.25 mm; Tstart: 80. C
CapillaryDB-Wax1915.Fu, Yoon, et al., 200230. m/0.25 mm/0.25 μm, He, 40. C @ 5. min, 8. K/min, 250. C @ 5. min
CapillaryPEG-20M1958.Awano, Honda, et al., 1997He, 3. K/min; Column length: 60. m; Column diameter: 0.25 mm; Tstart: 70. C; Tend: 210. C
CapillaryDB-Wax1956.Shimoda, Shiratsuchi, et al., 199360. m/0.25 mm/0.25 μm, He, 50. C @ 4. min, 2. K/min; Tend: 230. C

Normal alkane RI, polar column, custom temperature program

View large format table.

Column type Active phase I Reference Comment
CapillaryDB-Wax1957.Gyawali and Kim, 201260. m/0.20 mm/0.25 μm, Helium; Program: 40 0C (3 min) 2 0C/min -> 150 0C 4 0C/min -> 220 0C (20 min) 5 0C/min -> 230 0C
CapillaryDB-Wax1956.Welke, Manfroi, et al., 201230. m/0.25 mm/0.25 μm, Helium; Program: not specified
CapillaryDB-Wax1965.Welke, Manfroi, et al., 201230. m/0.25 mm/0.25 μm, Helium; Program: not specified
CapillaryHP-Innowax1982.Xiao, Dai, et al., 201160. m/0.25 mm/0.25 μm, Helium; Program: 40 0C (2 min) 3 0C/min -> 150 0C 5 0C/min -> 220 0C (5 min)
CapillarySupelcowax-101928.de Simon, Estruelas, et al., 200930. m/0.25 mm/0.25 μm, Helium; Program: 45 0C 3 0C/min -> 230 0C (10 min) 10 0C/min -> 270 0C (21 min)
CapillaryDB-Wax1960.Zhao, Xu, et al., 200930. m/0.25 mm/0.25 μm, Helium; Program: not specified
CapillarySOLGel-Wax1936.Shu and Shen, 200830. m/0.53 mm/0.50 μm, Helium; Program: 40 0C 7 0C/min -> 180 0C 10 0C/min -> 240 0C (10 min)
CapillarySOLGel-Wax1938.Shu and Shen, 200830. m/0.53 mm/0.50 μm, Helium; Program: not specified
CapillaryDB-Wax1937.Tao, Wenlai, et al., 200830. m/0.32 mm/0.25 μm, Helium; Program: 50 0C 20 0C/min -> 80 0C 3 0C/min -> 230 0C
CapillaryDB-Wax1948.Tian, Zhang, et al., 200730. m/0.25 mm/0.25 μm, He; Program: 50 0C (2 min) 6 0C/min -> 150 0C 8 0C/min -> 230 0C (15 min)
CapillaryDB-Wax1946.Lee, Lee, et al., 200560. m/0.32 mm/0.25 μm, He; Program: 30C(4min) => 2C/min => 170C(25min) => 10C/min => 210C(10min)
CapillaryDB-Wax1952.Lee, Lee, et al., 200560. m/0.32 mm/0.25 μm, He; Program: 30C(4min) => 2C/min => 170C(25min) => 10C/min => 210C(10min)
CapillaryTRWAX1999.Torrens, 200260. m/0.25 mm/0.25 μm, He; Program: not specified
CapillaryHP-Innowax1981.Gören, Demirci, et al., 200160. m/0.25 mm/0.25 μm, He; Program: 60 0C (10 min) 4 K/min -> 220 0C (10 min) 1 K/min -> 240 0C
CapillaryStabilwax DA1956.Henderson and Henderson, 199215. m/0.25 mm/0.25 μm, He; Program: not specified

Gas phase thermochemistry data

Data compiled by: Hussein Y. Afeefy, Joel F. Liebman, and Stephen E. Stein

Quantity Value Units Method Reference Comment
Δfgas-69.77kcal/molCcbPonomarev, Oleinikova, et al., 1987

Condensed phase thermochemistry data

Data compiled by: Hussein Y. Afeefy, Joel F. Liebman, and Stephen E. Stein

Quantity Value Units Method Reference Comment
Δfliquid-86.71 ± 0.53kcal/molCcbPonomarev, Oleinikova, et al., 1987
Quantity Value Units Method Reference Comment
Δcliquid-1007.3 ± 0.50kcal/molCcbPonomarev, Oleinikova, et al., 1987Corresponding Δfliquid = -86.71 kcal/mol (simple calculation by NIST; no Washburn corrections)

Phase change data

Data compiled as indicated in comments:
BS - Robert L. Brown and Stephen E. Stein
DRB - Donald R. Burgess, Jr.

Quantity Value Units Method Reference Comment
Tboil494.2KN/AWeast and Grasselli, 1989BS
Quantity Value Units Method Reference Comment
Δvap16.9kcal/molN/APonomarev, Oleinikova, et al., 1987DRB

Reduced pressure boiling point

Tboil (K) Pressure (atm) Reference Comment
386.70.029Weast and Grasselli, 1989BS
383. - 385.0.020Frinton Laboratories Inc., 1986BS

References

Wong and Teng, 1994
Wong, K.C.; Teng, Y.E., Volatile Components of Mimusops elengi L. Flowers, J. Essent. Oil Res., 1994, 6, 5, 453-458, https://doi.org/10.1080/10412905.1994.9698425 . [all data]

Duquesnoy, Dinh, et al., 2006
Duquesnoy, E.; Dinh, N.H.; Castola, V.; Casanova, J., Composition of a Pyrolytic oil from Cupressus funebris Endl. of Vietnamese origin, Flavour Fragr. J., 2006, 21, 3, 453-457, https://doi.org/10.1002/ffj.1676 . [all data]

Chevance and Farmer, 1999
Chevance, F.F.V.; Farmer, L.J., Identification of major volatile odor compounds in frankfurters, J. Agric. Food Chem., 1999, 47, 12, 5151-5160, https://doi.org/10.1021/jf990515d . [all data]

Stashenko, Prada, et al., 1996
Stashenko, E.E.; Prada, N.Q.; Martínez, J.R., HRGC/FID/NP and HRGC/MSD study of Colombian Ylang-Ylang (Cananga odorata) oils obtained by different extraction techniques, J. Hi. Res. Chromatogr., 1996, 19, 6, 353-358, https://doi.org/10.1002/jhrc.1240190609 . [all data]

Varlet, Serot, et al., 2007
Varlet, V.; Serot, T.; Cardinal, M.; Knockaert, C.; Prost, C., Olfactometric Determination of the Most Potent Odor-Active Compounds in Salmon Muscle (Salmo salar) Smoked by Using Four Smoke Generation Techniques, J. Agric. Food Chem., 2007, 55, 11, 4518-4525, https://doi.org/10.1021/jf063468f . [all data]

Varlet V., Knockaert C., et al., 2006
Varlet V.; Knockaert C.; Prost C.; Serot T., Comparison of odor-active volatile compounds of fresh and smoked salmon, J. Agric. Food Chem., 2006, 54, 9, 3391-3401, https://doi.org/10.1021/jf053001p . [all data]

Ré-Poppi and Santiago-Silva, 2005
Ré-Poppi, N.; Santiago-Silva, M., Polycyclic aromatic hydrocarbons and other selected organic compounds in ambient air of Campo Grande City, Brazil, Atmos. Environ., 2005, 39, 16, 2839-2850, https://doi.org/10.1016/j.atmosenv.2004.10.006 . [all data]

Ré-Poppi and Santiago-Silva, 2002
Ré-Poppi, N.; Santiago-Silva, M.R., Identification of polycyclic aromatic hydrocarbons and methoxylated phenols in wood smoke emitted during production of charcoal, Chromatographia, 2002, 55, 7/8, 475-481, https://doi.org/10.1007/BF02492280 . [all data]

Boulanger and Crouzet, 2000
Boulanger, R.; Crouzet, J., Free and bound flavour components of Amazonian fruits: 3-glycosidically bound components of cupuacu, Food Chem., 2000, 70, 4, 463-470, https://doi.org/10.1016/S0308-8146(00)00112-6 . [all data]

Boulanger, Chassagne, et al., 1999
Boulanger, R.; Chassagne, D.; Crouzet, J., Free and bound flavour components of amazonian fruits. 1: Bacuri, Flavour Fragr. J., 1999, 14, 5, 303-311, https://doi.org/10.1002/(SICI)1099-1026(199909/10)14:5<303::AID-FFJ834>3.0.CO;2-C . [all data]

Ledauphin, Saint-Clair, et al., 2004
Ledauphin, J.; Saint-Clair, J.-F.; Lablanquie, O.; Guichard, H.; Founier, N.; Guichard, E.; Barillier, D., Identification of trace volatile compounds in freshly distilled calvados and cognac using preparative separations coupled with gas chromatography-mass spectrometry, J. Agric. Food Chem., 2004, 52, 16, 5124-5134, https://doi.org/10.1021/jf040052y . [all data]

Chevance and Farmer, 1999, 2
Chevance, F.F.V.; Farmer, L.J., Release of volatile odor compounds from full-fat and reduced-fat frankfurters, J. Agric. Food Chem., 1999, 47, 12, 5161-5168, https://doi.org/10.1021/jf9905166 . [all data]

Christensen, Jakobsen, et al., 1997
Christensen, L.P.; Jakobsen, H.B.; Kristiansen, K.; Møller, J., Volatiles emitted from flowers of γ-radiated and nonradiated Jasminum polyanthum Franch. in Situ, J. Agric. Food Chem., 1997, 45, 6, 2199-2203, https://doi.org/10.1021/jf960961q . [all data]

Shiratsuchi, Shimoda, et al., 1993
Shiratsuchi, H.; Shimoda, M.; Minegishi, Y.; Osajima, Y., Isolation and identification of volatile flavor compounds in nonfermented coarse-cut sausage. Flavor as a quality factor of nonfermented sausage. 1, J. Agric. Food Chem., 1993, 41, 4, 647-652, https://doi.org/10.1021/jf00028a027 . [all data]

Natali N., Chinnici F., et al., 2006
Natali N.; Chinnici F.; Riponi C., Characterization of volatiles in extracts from oak chips obtained by accelerated solvent extraction (ASE), J. Agric. Food Chem., 2006, 54, 21, 8190-8198, https://doi.org/10.1021/jf0614387 . [all data]

Souza, Re-Poppi, et al., 2012
Souza, J.B.G.; Re-Poppi, N.; Raposo, J.L.(Jr)., Characterization of pyroligneous acid used in agriculture by gas chromatography - mass spectrometry (in press), J. Braz. Chem. Soc., 2012, 00, 00, 1-8. [all data]

Jerkovic, Hegic, et al., 2010
Jerkovic, I.; Hegic, G.; Marijanovic, Z.; Bubalo, D., Organic extractives from Mentha spp. honey and the bee-stomach: methyl syringate, vomifoliol, terpenediol I, hotrienol, and other compounds, Molecules, 2010, 15, 4, 2911-2924, https://doi.org/10.3390/molecules15042911 . [all data]

Majcher, Lawrowski, et al., 2010
Majcher, M.; Lawrowski, P.; Jelen, H., Comparison of original and adulterated oscypek cheese based on volatile and sensory profiles, Acta Sci. Pol. Technol. Aliment., 2010, 9, 3, 265-275. [all data]

Fan and Qian, 2006
Fan, W.; Qian, M.C., Identification of aroma compounds in Chinese 'Yanghe Daqu' liquor by normal phase chromatography fractionation followed by gas chromatography/olfactometry, Flavour Fragr. J., 2006, 21, 2, 333-342, https://doi.org/10.1002/ffj.1621 . [all data]

Lee, Lee, et al., 2005
Lee, K.-G.; Lee, S.-E.; Takeoka, G.R.; Kim, J.-H.; Park, B.-S., Antioxidant activity and characterization of volatile constituents of beechwood creosote, J. Sci. Food Agric., 2005, 85, 9, 1580-1586, https://doi.org/10.1002/jsfa.2156 . [all data]

Park, Lee, et al., 2004
Park, B.-S.; Lee, K.-G.; Takeoka, G.R., Comparison of three sample preparation methods on the recovery of volatiles from taheebo (Tabebuia impetiginosa Martius ex DC), Flavour Fragr. J., 2004, 19, 4, 287-292, https://doi.org/10.1002/ffj.1345 . [all data]

Poligné, Collignan, et al., 2001
Poligné, I.; Collignan, A.; Trystram, G., Characterization of traditional processing of pork meat into boucané, Meat Sci., 2001, 59, 4, 377-389, https://doi.org/10.1016/S0309-1740(01)00090-0 . [all data]

Kjällstrand, Ramnäs, et al., 1998
Kjällstrand, J.; Ramnäs, O.; Petersson, G., Gas chromatographic and mass spectrometric analysis of 36 lignin-related methoxyphenols from uncontrolled combustion of wood, J. Chromatogr. A, 1998, 824, 2, 205-210, https://doi.org/10.1016/S0021-9673(98)00698-0 . [all data]

Stashenko, Torres, et al., 1995
Stashenko, E.E.; Torres, W.; Morales, J.R.M., A study of the compositional variation of the essential oil of ylang-ylang (Cananga odorata Hook Fil. et Thomson, forma genuina) during flower development, J. Hi. Res. Chromatogr., 1995, 18, 2, 101-104, https://doi.org/10.1002/jhrc.1240180206 . [all data]

Shiota, 1993
Shiota, H., New esteric components in the volatiles of banana fruit (Musa sapientum L.), J. Agric. Food Chem., 1993, 41, 11, 2056-2062, https://doi.org/10.1021/jf00035a046 . [all data]

Mondello, 2012
Mondello, L., HS-SPME-GCxGC-MS analysis of Yerba Mate (Ilex paraguariensis) in Shimadzu GC-GC application compendium of comprehensive 2D GC, Vol. 1-5, Shimadzu Corp., 2012, 1-29. [all data]

Robinson, Adams, et al., 2012
Robinson, A.L.; Adams, D.O.; Boss, P.K.; Heymann, H.; Solomon, P.S.; Trengove, R.D., Influence of geographic origine on the sensory characteristics and wine composition of Vitus viniferas cv. Cabernet Sauvignon wines from Australia (Supplemental data), Am. J. Enol. Vitic., 2012, 64, 4, 467-476, https://doi.org/10.5344/ajev.2012.12023 . [all data]

de Simon, Estruelas, et al., 2009
de Simon, B.F.; Estruelas, E.; Munoz, A.M.; Cadahia, E.; Sanz, M., Volatile compounds in acacia, chestnut, cherry, ash, and oak woods, with a view to their use in cooperage, J. Agric. Food Chem., 2009, 57, 8, 3217-3227, https://doi.org/10.1021/jf803463h . [all data]

Zhao, Li, et al., 2008
Zhao, Y.; Li, J.; Xu, Y.; Duan, H.; Fan, W.; Zhao, G., EXtraction, preparation and identification of volatile compounds in Changyu XO brandy, Chinese J. Chromatogr., 2008, 26, 2, 212-222, https://doi.org/10.1016/S1872-2059(08)60014-0 . [all data]

RAyne and Eggers, 2007
RAyne, S.; Eggers, N.J., A new conceptual approach to assisting biomass combustion-derived methoxyphenol structures by using a gas chromatographic retention index method, Anal. Bioanal. Chem., 2007, 389, 2, 555-561, https://doi.org/10.1007/s00216-007-1442-5 . [all data]

Sung, Stone, et al., 2007
Sung, W.-C.; Stone, M.; Sun, F.-M., Analysis of volatile constituents of different temperature rice hulls liquid smoke, Chi-Nan Annual Bull., 2007, 33, 1-12. [all data]

Hamm, Bleton, et al., 2004
Hamm, S.; Bleton, J.; Tchapla, A., Headspace solid phase microextraction for screening for the presence of resins in Egyptian archaeological samples, J. Sep. Sci., 2004, 27, 3, 235-243, https://doi.org/10.1002/jssc.200301611 . [all data]

Fu, Yoon, et al., 2002
Fu, S.-G.; Yoon, Y.; Basemore, R., Aroma-actie components in fermented bamboo shoots, J. Agric. Food Chem., 2002, 50, 3, 549-554, https://doi.org/10.1021/jf010883t . [all data]

Poligne, Collignan, et al., 2002
Poligne, I.; Collignan, A.; Trystram, G., Effects of salting, drying, cooking, and smoking operations on volatile compound formation and collor patterns in pork, Food Eng. Physical Properties, 2002, 67, 8, 2976-2986. [all data]

Ansorena, Gimeno, et al., 2001
Ansorena, D.; Gimeno, O.; Astiasarán, I.; Bello, J., Analysis of volatile compounds by GC-MS of a dry fermented sausage: chorizo de Pamplona, Food Res. Int., 2001, 34, 1, 67-75, https://doi.org/10.1016/S0963-9969(00)00133-2 . [all data]

Ansorena, Astiasarán, et al., 2000
Ansorena, D.; Astiasarán, I.; Bello, J., Influence of the simultaneous addition of the protease flavourzyme and the lipase novozyme 677BG on dry fermented sausage compounds extracted by SDE and analyzed by GC-MS, J. Agric. Food Chem., 2000, 48, 6, 2395-2400, https://doi.org/10.1021/jf990931y . [all data]

Mateo and Zumalacárregui, 1996
Mateo, J.; Zumalacárregui, J.M., Volatile compounds in chorizo and their changes during ripening, Meat Sci., 1996, 44, 4, 255-273, https://doi.org/10.1016/S0309-1740(96)00028-9 . [all data]

Kiss, Csoka, et al., 2011
Kiss, M.; Csoka, M.; Gyorfi, J.; Korany, K., Comparison of the fragrance constituents of Tuber aestivium and Tuber Brumale gathered in Hungary, J. Appl. Botany Food Quality, 2011, 84, 102-110. [all data]

Zhao, Xu, et al., 2009
Zhao, Y.; Xu, Y.; Li, J.; Fan, W.; Jiang, W., Profile of volatile compounds in 11 brandies by headspace solid-phase microextraction followed by gas chromatography-mass spectrometry, J. Food. Sci., 2009, 74, 2, c90-c99, https://doi.org/10.1111/j.1750-3841.2008.01029.x . [all data]

Yao, Guo, et al., 2005
Yao, S.-S.; Guo, W.-F.; Lu, Y.; Jiang, Y.-X., Flavor Characteristics of Lapsang Souchong and Smoked Lapsang Souchong, a Special Chinese Black Tea with Pine Smoking Process, J. Agric. Food Chem., 2005, 53, 22, 8688-8693, https://doi.org/10.1021/jf058059i . [all data]

Miyazawa and Okuno, 2003
Miyazawa, M.; Okuno, Y., Volatile components from the roots of Scrophularia ningpoensis Hemsl., Flavour Fragr. J., 2003, 18, 5, 398-400, https://doi.org/10.1002/ffj.1232 . [all data]

Awano, Honda, et al., 1997
Awano, K.; Honda, T.; Ogawa, T.; Suzuki, S.; Matsunaga, Y., Volatile components of Phalaenopsis schilleriana Rehb. f., Flavour Fragr. J., 1997, 12, 5, 341-344, https://doi.org/10.1002/(SICI)1099-1026(199709/10)12:5<341::AID-FFJ657>3.0.CO;2-L . [all data]

Shimoda, Shiratsuchi, et al., 1993
Shimoda, M.; Shiratsuchi, H.; Minegishi, Y.; Osajima, Y., Flavor deterioration of nonfermented coarse-cut sausage during storage. Flavor as a factor of quality for nonfermented sausage. 2, J. Agric. Food Chem., 1993, 41, 6, 946-950, https://doi.org/10.1021/jf00030a021 . [all data]

Gyawali and Kim, 2012
Gyawali, R.; Kim, K.-S., Bioactive volatile compounds of three medicinal plants from Nepal, Kathmandu Univ. J. Sci., Engineering and Technol., 2012, 8, 1, 51-62. [all data]

Welke, Manfroi, et al., 2012
Welke, J.E.; Manfroi, V.; Zanus, M.; Lazarotto, M.; Zini, C.A., Characterization of the volatile profile of Brazilian merlot wines through comprehensive two dimensional gas chromatography time-of-flight mass spectrometric detection, J. Chromatogr. A, 2012, 1226, 124-139, https://doi.org/10.1016/j.chroma.2012.01.002 . [all data]

Xiao, Dai, et al., 2011
Xiao, Z.; Dai, S.; Niu, Y.; Yu, H.; Zhu, J.; Tian, H.; Gu, Y., Discrimination of Chinese vinegars based on headspace solid-phase microextraction - gas chromatography mass spectrometry of volatile compounds and multivariate analysis, J. Food Sci., 2011, 76, 8, c1125-c1135, https://doi.org/10.1111/j.1750-3841.2011.02356.x . [all data]

Shu and Shen, 2008
Shu, N.; Shen, H., Aroma-impact compounds in Lysimachia foenum-graecum extracts, Flavour Fragr. J., 2008, 24, 1, 1-6, https://doi.org/10.1002/ffj.1908 . [all data]

Tao, Wenlai, et al., 2008
Tao, L.; Wenlai, F.; Yan, X., Characterization of volatile and semi-volatile compounds in Chinese rica wines by headspace solid phase microextraction followed by gas chromatography - mass spectrometry, J. Inst. Brew., 2008, 114, 2, 172-179, https://doi.org/10.1002/j.2050-0416.2008.tb00323.x . [all data]

Tian, Zhang, et al., 2007
Tian, Y.; Zhang, X.; Huang, T.; Zou, K.; Zhou, J., Research advances on the essential oils from leaves of Eucalyptus, Food Fermentation Ind. (Chinese), 2007, 33, 10, 143-147. [all data]

Torrens, 2002
Torrens, J., El análisis del aroma aplicado al control de calidad del cava [CS2002 Análisis sensorial (vino)], 2002, retrieved from http://www.percepnet.com/documenta/CS0203.pdf. [all data]

Gören, Demirci, et al., 2001
Gören, N.; Demirci, B.; Baser, K.H.C., Composition of the essential oils of Tanacetum spp. from Turkey, Flavour Fragr. J., 2001, 16, 3, 191-194, https://doi.org/10.1002/ffj.976 . [all data]

Henderson and Henderson, 1992
Henderson, D.E.; Henderson, S.K., Thermal decomposition of capsaicin. 1. Interactions with oleic acid at high temperatures, J. Agric. Food Chem., 1992, 40, 11, 2263-2268, https://doi.org/10.1021/jf00023a042 . [all data]