Phenol, 2,3,6-trichloro-

Kovats' RI, non-polar column, isothermal

Data compiled by: NIST Mass Spectrometry Data Center, William E. Wallace, director

Column type CapillaryCapillaryCapillaryCapillary
Active phase SE-30SE-30SE-30SE-30
Column length (m) 25.
Carrier gas
Substrate
Column diameter (mm) 0.32
Phase thickness (μm)
Temperature (C) 160.140.160.180.
I 1354.1352.1354.1359.
ReferenceEvans and Haken, 1989Korhonen, 1984Korhonen, 1984Korhonen, 1984
Comment MSDC-RI MSDC-RI MSDC-RI MSDC-RI

Van Den Dool and Kratz RI, non-polar column, temperature ramp

Data compiled by: NIST Mass Spectrometry Data Center, William E. Wallace, director

Column type CapillaryCapillaryCapillary
Active phase SE-30SE-30SE-30
Column length (m)
Carrier gas
Substrate
Column diameter (mm)
Phase thickness (μm)
Tstart (C) 100.100.100.
Tend (C)
Heat rate (K/min) 10.2.6.
Initial hold (min)
Final hold (min)
I 1378.1353.1368.
ReferenceKorhonen, 1984Korhonen, 1984Korhonen, 1984
Comment MSDC-RI MSDC-RI MSDC-RI

Normal alkane RI, non-polar column, custom temperature program

Data compiled by: NIST Mass Spectrometry Data Center, William E. Wallace, director

Column type CapillaryCapillary
Active phase PTE-5Ultra-2
Column length (m) 25.25.
Carrier gas
Substrate
Column diameter (mm) 0.200.20
Phase thickness (μm) 0.330.33
Program 50 0C (2 min) 30 0C/min -> 200 0C 8 0C/min -> 280 0C (10 min)50 0C (2 min) 30 0C/min -> 200 0C 8 0C/min -> 280 0C (10 min)
I 1417.1421.
ReferenceNakano, Fujimori, et al., 1992Nakano, Fujimori, et al., 1992
Comment MSDC-RI MSDC-RI

References

Evans and Haken, 1989
Evans, M.B.; Haken, J.K., Dispersion and selectivity indices in gas chromatography. IV. Chlorinated aromatic compounds, J. Chromatogr., 1989, 468, 373-382, https://doi.org/10.1016/S0021-9673(00)96332-5 . [all data]

Korhonen, 1984
Korhonen, I.O.O., Gas-liquid chromatographic analyses. XXXI. Retention increments of isomeric chlorophenols on low-polarity (SE-30) and polar (FFAP) capillary columns, J. Chromatogr., 1984, 315, 185-200, https://doi.org/10.1016/S0021-9673(01)90736-8 . [all data]