Quinoline, 2-(2-methylpropyl)-

Kovats' RI, polar column, isothermal

Data compiled by: NIST Mass Spectrometry Data Center, William E. Wallace, director

Column type CapillaryCapillaryCapillaryCapillaryCapillary
Active phase PEG-20MPEG-20MPEG-20MPEG-20MPEG-20M
Column length (m)   30.30.30.
Carrier gas HeHeN2N2N2
Substrate
Column diameter (mm)   0.250.250.25
Phase thickness (μm)
Temperature (C) 140.160.140.160.140.
I 2048.2077.2048.2077.2048.
ReferenceDmitrikov and Nabivach, 1995Dmitrikov and Nabivach, 1995Berlizov, Nabivach, et al., 1987Berlizov, Nabivach, et al., 1987Buryan, Macák, et al., 1987
Comment MSDC-RI MSDC-RI MSDC-RI MSDC-RI MSDC-RI
Column type Capillary
Active phase PEG-20M
Column length (m) 30.
Carrier gas N2
Substrate
Column diameter (mm) 0.25
Phase thickness (μm)
Temperature (C) 160.
I 2077.
ReferenceBuryan, Macák, et al., 1987
Comment MSDC-RI

References

Dmitrikov and Nabivach, 1995
Dmitrikov, V.P.; Nabivach, V.M., Physico-chemical regularities of quinoline bases retention in gas chromatography, Coke Chem. (Engl. Transl.), 1995, 8, 27-34. [all data]

Berlizov, Nabivach, et al., 1987
Berlizov, Yu.S.; Nabivach, V.M.; Mitrikov, V.P., Capillary gas chromatography of alkylquinolines, Zh. Anal. Khim., 1987, 62, 6, 1119-1124. [all data]

Buryan, Macák, et al., 1987
Buryan, P.; Macák, J.; Triska, J.; Vodicka, L.; Berlizov, Yu.S.; Dmitrikov, V.P.; Nabivach, V.M., Kováts retention indices of alkylquinolines on capillary columns, J. Chromatogr., 1987, 391, 89-96, https://doi.org/10.1016/S0021-9673(01)94307-9 . [all data]