Benzene, 1,2-dimethoxy-4-(1-propenyl)-

Van Den Dool and Kratz RI, non-polar column, temperature ramp

Data compiled by: NIST Mass Spectrometry Data Center, William E. Wallace, director

Column type CapillaryCapillaryCapillaryCapillaryCapillary
Active phase DB-5DB-5BPX-5HP-5OV-1
Column length (m) 30.30.50.30.25.
Carrier gas HeN2H2HeH2
Substrate
Column diameter (mm) 0.320.250.220.250.25
Phase thickness (μm) 0.250.250.250.250.3
Tstart (C) 40.45.60.50.50.
Tend (C) 230.180.180.280.200.
Heat rate (K/min) 6.2.54.4.3.
Initial hold (min) 1.10.5.5.1.
Final hold (min)  20.5. 20.
I 1495.1508.1520.1455.1461.
ReferenceZeller and Rychlik, 2006Zhang, Xu, et al., 2005Zabaras and Wyllie, 2001Lazari, Skaltsa, et al., 2000Bicchi, Fresia, et al., 1997
Comment MSDC-RI MSDC-RI MSDC-RI MSDC-RI MSDC-RI

Phase change data

Data compiled as indicated in comments:
BS - Robert L. Brown and Stephen E. Stein
AC - William E. Acree, Jr., James S. Chickos

Quantity Value Units Method Reference Comment
Tboil536.2KN/AAldrich Chemical Company Inc., 1990BS

Enthalpy of vaporization

ΔvapH (kJ/mol) Temperature (K) Method Reference Comment
61.9373.AStephenson and Malanowski, 1987Based on data from 358. - 521. K. See also Stull, 1947.; AC

Normal alkane RI, non-polar column, temperature ramp

Data compiled by: NIST Mass Spectrometry Data Center, William E. Wallace, director

Column type CapillaryCapillaryCapillaryCapillaryCapillary
Active phase DB-5DB-5DB-5CP Sil 8 CBDB-5
Column length (m) 30.30.30.30.30.
Carrier gas HeliumHeliumNitrogenHeHe
Substrate
Column diameter (mm) 0.250.250.250.250.25
Phase thickness (μm) 0.250.250.25 0.25
Tstart (C) 60.50.40.60.60.
Tend (C) 240.250.250.290.280.
Heat rate (K/min) 3.5.3.3.3.
Initial hold (min)  2.1.5.
Final hold (min)   10. 30.
I 1492.1492.1492.1504.1491.
ReferenceAndrade, Cardoso, et al., 2011Ho, Wang, et al., 2009Rahimi-Nasrabadi, Gholivand, et al., 2009Suárez, Vásquez, et al., 2005Caredda, Marongiu, et al., 2002
Comment MSDC-RI MSDC-RI MSDC-RI MSDC-RI MSDC-RI
Column type CapillaryCapillary
Active phase OV-101OV-101
Column length (m) 50.50.
Carrier gas N2N2
Substrate
Column diameter (mm) 0.20.25
Phase thickness (μm)
Tstart (C) 80.80.
Tend (C) 200.200.
Heat rate (K/min) 1.2.
Initial hold (min)
Final hold (min) 20.
I 1468.1468.
ReferenceMenon, Chacko, et al., 1999Sugisawa, Yamamoto, et al., 1989
Comment MSDC-RI MSDC-RI

References

Zeller and Rychlik, 2006
Zeller, A.; Rychlik, M., Character impact odorants of fennel fruits and fennel tea, J. Agric. Food Chem., 2006, 54, 10, 3686-3692, https://doi.org/10.1021/jf052944j . [all data]

Zhang, Xu, et al., 2005
Zhang, F.; Xu, Q.; Fu, S.; Ma, X.; Xiao, H.; Liang, X., Chemical constituents of the essential oil of Asarum forbesii Maxim (Aristolochiaceae), Flavour Fragr. J., 2005, 20, 3, 318-320, https://doi.org/10.1002/ffj.1423 . [all data]

Zabaras and Wyllie, 2001
Zabaras, D.; Wyllie, S.G., Quantitative analysis of terpenoids in the gas phase using headspace solid-phase microextraction (HS-SPME), Flavour Fragr. J., 2001, 16, 6, 411-416, https://doi.org/10.1002/ffj.1025 . [all data]

Lazari, Skaltsa, et al., 2000
Lazari, D.M.; Skaltsa, H.D.; Constantinidis, T., Volatile constituents of Cerastium candidissimum, a Greek endemic species, Flavour Fragr. J., 2000, 15, 3, 174-176, https://doi.org/10.1002/1099-1026(200005/06)15:3<174::AID-FFJ886>3.0.CO;2-Y . [all data]

Bicchi, Fresia, et al., 1997
Bicchi, C.; Fresia, M.; Rubiolo, P.; Monti, D.; Franz, C.; Goehler, I., Constituents of Tagetes lucida Cav. ssp. lucida essential oil, Flavour Fragr. J., 1997, 12, 1, 47-52, https://doi.org/10.1002/(SICI)1099-1026(199701)12:1<47::AID-FFJ610>3.0.CO;2-7 . [all data]