(E)-3-Hexene-2,5-diol, 2,5-dimethyl-

Condensed phase thermochemistry data

Data compiled by: Hussein Y. Afeefy, Joel F. Liebman, and Stephen E. Stein

Quantity Value Units Method Reference Comment
Δcsolid-1171.71 ± 0.72kcal/molCcbRoth and Muller, 1927Authors' U=-8145±2 cal/g; Corresponding Δfsolid = -127.22 kcal/mol (simple calculation by NIST; no Washburn corrections)

References

Roth and Muller, 1927
Roth, W.A.; Muller, Fr., Thermische Untersuchungen an einigen Olefinen und Acetylen-Derivaten, Ber., 1927, 60, 643-645. [all data]