2-Propenal, 3-(dimethylamino)-

Gas phase thermochemistry data

Data compiled by: Hussein Y. Afeefy, Joel F. Liebman, and Stephen E. Stein

Quantity Value Units Method Reference Comment
Δfgas-104.0kJ/molCcbRauh, Schnabel, et al., 1974

References

Rauh, Schnabel, et al., 1974
Rauh, H.J.; Schnabel, R.; Geiseler, G.; Daehne, S., Bildungsenthalpien und Measomerieenergien von π-Bindungssystemen, Z. Phys. Chem. (Leipzig), 1974, 255, 651-654. [all data]