7-Tridecanol

Normal alkane RI, polar column, custom temperature program

Data compiled by: NIST Mass Spectrometry Data Center, William E. Wallace, director

Column type Capillary
Active phase PEG-20M
Column length (m)
Carrier gas
Substrate
Column diameter (mm)
Phase thickness (μm)
Program not specified
I 1852.
ReferenceQin, 2009
Comment MSDC-RI

References

Qin, 2009
Qin, Z., Relationship between the molecular structure and gas chromatographic retention index of alcohol isomer, J. Xuzhou Norm. Univ. (Nat. Sci. Edn.), 2009, 27, 2, 88-90. [all data]