Tetraphenylporphyrin

Condensed phase thermochemistry data

Data compiled by: Hussein Y. Afeefy, Joel F. Liebman, and Stephen E. Stein

Quantity Value Units Method Reference Comment
Δfsolid621.3 ± 6.3kJ/molCcbWu, Xu, et al., 1989see 62LI/LUO
Quantity Value Units Method Reference Comment
Δcsolid-22223.2 ± 6.3kJ/molCcbWu, Xu, et al., 1989see 62LI/LUO

Phase change data

Data compiled as indicated in comments:
ALS - Hussein Y. Afeefy, Joel F. Liebman, and Stephen E. Stein
AC - William E. Acree, Jr., James S. Chickos

Quantity Value Units Method Reference Comment
Δsub58.37kcal/molEWu, Xu, et al., 1989see 62LI/LUO; ALS

Enthalpy of sublimation

ΔsubH (kcal/mol) Temperature (K) Method Reference Comment
33.9 ± 0.7626. - 707.FluorescStefanov, Stibor, et al., 2004AC
40.9 ± 0.5550.METorres, Campos, et al., 2002Based on data from 543. - 555. K.; AC
26.5 ± 1.2603.MEStephenson and Malanowski, 1987Based on data from 588. - 678. K. See also Bonderman, Cater, et al., 1970.; AC

References

Wu, Xu, et al., 1989
Wu, D.; Xu, G.; Qu, S.; Xue, R.; Gu, C.; Zhang, F., Standard enthalpies of combustion and formation of porphyrin derivatives, Thermochim. Acta, 1989, 154, 233-245. [all data]