Sparteine

Van Den Dool and Kratz RI, non-polar column, temperature ramp

Data compiled by: NIST Mass Spectrometry Data Center, William E. Wallace, director

Column type CapillaryPacked
Active phase HP-5MSSE-30
Column length (m) 30.1.8
Carrier gas HeN2
Substrate  Chromosorb W
Column diameter (mm) 0.25
Phase thickness (μm) 0.25
Tstart (C) 70.130.
Tend (C) 300.290.
Heat rate (K/min) 4.8.
Initial hold (min)  2.
Final hold (min)  8.
I 1776.1780.
ReferenceGuimaraes P.R., Jose J., et al., 2003Perrigo and Peel, 1981
Comment MSDC-RI MSDC-RI

Kovats' RI, non-polar column, isothermal

Data compiled by: NIST Mass Spectrometry Data Center, William E. Wallace, director

Column type PackedCapillary
Active phase SE-30SPB-1
Column length (m) 2.25.
Carrier gas N2He
Substrate 1% se-30 on Anachrom ABS(80-100mesh)
Column diameter (mm)  0.20
Phase thickness (μm)
Temperature (C) 180.250.
I 1795.1830.
ReferenceMusumarra, Scarlata, et al., 1987Lora-Tamayo, Rams, et al., 1986
Comment MSDC-RI MSDC-RI

References

Guimaraes P.R., Jose J., et al., 2003
Guimaraes P.R.; Jose J.; Galetti M.; Trigo J.R., Quinolizidine alkaloids in Ormosia arborea seeds inhibit predation but not hoarding by agoutis (Dasyprocta leporina), J. Chem. Ecol., 2003, 29, 5, 1065-1072, https://doi.org/10.1023/A:1023817203748 . [all data]

Perrigo and Peel, 1981
Perrigo, B.J.; Peel, H.W., The use of retention indices and temperature-programmed gas chromatography in analytical toxicology, J. Chromatogr. Sci., 1981, 19, 5, 219-226, https://doi.org/10.1093/chromsci/19.5.219 . [all data]