1,2-Dimethoxy-3-chloro-benzene

Kovats' RI, non-polar column, isothermal

Data compiled by: NIST Mass Spectrometry Data Center, William E. Wallace, director

Column type CapillaryCapillaryCapillaryCapillary
Active phase SE-30SE-30SE-30SE-30
Column length (m) 25.25.25.25.
Carrier gas
Substrate
Column diameter (mm) 0.300.300.300.30
Phase thickness (μm)
Temperature (C) 140.160.180.200.
I 1266.1262.1263.1281.
ReferenceKorhonen, Knuutinen, et al., 1984Korhonen, Knuutinen, et al., 1984Korhonen, Knuutinen, et al., 1984Korhonen, Knuutinen, et al., 1984
Comment MSDC-RI MSDC-RI MSDC-RI MSDC-RI

References

Korhonen, Knuutinen, et al., 1984
Korhonen, I.O.O.; Knuutinen, J.; Jaaskelainen, R., Gas-Liquid Chromatographic Analyses. XXIV. Capillary Column Studies of the Chlorinated Veratroles (1,2-Dimethoxybenzenes), J. Chromatogr., 1984, 287, 293-303, https://doi.org/10.1016/S0021-9673(01)87704-9 . [all data]