Cyclopropanecarboxylic acid, 2-methylene-, methyl ester

Lee's RI, non-polar column, custom temperature program

Data compiled by: NIST Mass Spectrometry Data Center, William E. Wallace, director

Column type Capillary
Active phase DB-5
Column length (m) 60.
Carrier gas
Substrate
Column diameter (mm)
Phase thickness (μm)
Program not specified
I 138.5
ReferenceFuentes, Font, et al., 2007
Comment MSDC-RI

References

Fuentes, Font, et al., 2007
Fuentes, M.J.; Font, R.; Gomez-Rico, M.F.; Martin-Gullon, I., Pyrolysis and combustion of waste lubricant oil from diesel cars: Decomposition and pollutants, J. Anal. Appl. Pyrolysis, 2007, 79, 1-2, 215-226, https://doi.org/10.1016/j.jaap.2006.12.004 . [all data]